Reaction Details
TargetrRNA adenine N-6-methyltransferase
LigandBDBM50081300
Substrate/Competitorn/a
Meas. Tech.ChEMBL_67531 (CHEMBL679968)
Ki 7500±n/a nM
Citation Hajduk, PJDinges, JSchkeryantz, JMJanowick, DKaminski, MTufano, MAugeri, DJPetros, ANienaber, VZhong, PHammond, RCoen, MBeutel, BKatz, LFesik, SW Novel inhibitors of Erm methyltransferases from NMR and parallel synthesis. J Med Chem42:3852-9 (1999) rRNA adenine N-6-methyltransferase
Name:rRNA adenine N-6-methyltransferase
Type:PROTEIN
Mol. Mass.:28804.82
Organism:Streptococcus pneumoniae
Description:ChEMBL_67532
Residue:245
BDBM50081300
NameBDBM50081300
Synonyms:2-(3-{4-[2-Amino-6-(indan-2-ylamino)-pyrimidin-4-yl]-phenylamino}-propyl)-phenol | CHEMBL125085
TypeSmall organic molecule
Emp. Form.C28H29N5O
Mol. Mass.451.5628
SMILESNc1nc(NC2Cc3ccccc3C2)cc(n1)-c1ccc(NCCCc2ccccc2O)cc1