Reaction Details
TargetrRNA adenine N-6-methyltransferase
LigandBDBM50081299
Substrate/Competitorn/a
Meas. Tech.ChEMBL_67531 (CHEMBL679968)
Ki 3000±n/a nM
Citation Hajduk, PJDinges, JSchkeryantz, JMJanowick, DKaminski, MTufano, MAugeri, DJPetros, ANienaber, VZhong, PHammond, RCoen, MBeutel, BKatz, LFesik, SW Novel inhibitors of Erm methyltransferases from NMR and parallel synthesis. J Med Chem42:3852-9 (1999) rRNA adenine N-6-methyltransferase
Name:rRNA adenine N-6-methyltransferase
Type:PROTEIN
Mol. Mass.:28804.82
Organism:Streptococcus pneumoniae
Description:ChEMBL_67532
Residue:245
BDBM50081299
NameBDBM50081299
Synonyms:CHEMBL125249 | N-(5-Fluoro-indan-2-yl)-6-piperidin-1-yl-[1,3,5]triazine-2,4-diamine
TypeSmall organic molecule
Emp. Form.C17H21FN6
Mol. Mass.328.3872
SMILESNc1nc(NC2Cc3ccc(F)cc3C2)nc(n1)N1CCCCC1