Reaction Details
TargetProstaglandin F2-alpha receptor
LigandBDBM50081445
Substrate/Competitorn/a
Meas. Tech.ChEBML_158457
Ki 1300±n/a nM
Citation Ruel, RLacombe, PAbramovitz, MGodbout, CLamontagne, SRochette, CSawyer, NStocco, RTremblay, NMMetters, KMLabelle, M New class of biphenylene dibenzazocinones as potent ligands for the human EP1 prostanoid receptor. Bioorg Med Chem Lett9:2699-704 (1999) Prostaglandin F2-alpha receptor
Name:Prostaglandin F2-alpha receptor
Type:Enzyme
Mol. Mass.:40072.29
Organism:Homo sapiens (Human)
Description:P43088
Residue:359
BDBM50081445
NameBDBM50081445
Synonyms:4'-(6-Oxo-11,12-dihydro-6H-dibenzo[b,f]azocin-5-ylmethyl)-biphenyl-2-sulfonic acid (2,2-dimethyl-3-phenyl-propionyl)-amide | CHEMBL315391
TypeSmall organic molecule
Emp. Form.C39H36N2O4S
Mol. Mass.628.779
SMILESCC(C)(Cc1ccccc1)C(=O)NS(=O)(=O)c1ccccc1-c1ccc(CN2c3ccccc3CCc3ccccc3C2=O)cc1