Reaction Details
TargetProstaglandin E2 receptor EP1 subtype
LigandBDBM50081450
Substrate/Competitorn/a
Meas. Tech.ChEBML_158177
Ki 120±n/a nM
Citation Ruel, RLacombe, PAbramovitz, MGodbout, CLamontagne, SRochette, CSawyer, NStocco, RTremblay, NMMetters, KMLabelle, M New class of biphenylene dibenzazocinones as potent ligands for the human EP1 prostanoid receptor. Bioorg Med Chem Lett9:2699-704 (1999) Prostaglandin E2 receptor EP1 subtype
Name:Prostaglandin E2 receptor EP1 subtype
Type:Enzyme
Mol. Mass.:41834.57
Organism:Homo sapiens (Human)
Description:P34995
Residue:402
BDBM50081450
NameBDBM50081450
Synonyms:CHEMBL90269 | sulfonylurea analogue
TypeSmall organic molecule
Emp. Form.C37H33N3O4S
Mol. Mass.615.741
SMILESO=C(NCCc1ccccc1)NS(=O)(=O)c1ccccc1-c1ccc(CN2c3ccccc3CCc3ccccc3C2=O)cc1