Reaction Details
TargetReverse transcriptase/RNaseH
LigandBDBM1434
Substrate/Competitorn/a
Meas. Tech.ChEBML_195502
IC50 23000±n/a nM
Citation Uckun, FMMao, CPendergrass, SMaher, DZhu, DTuel-Ahlgren, LVenkatachalam, TK N-[2-(1-cyclohexenyl)ethyl]-N'-[2-(5-bromopyridyl)]-thiourea and N'-[2-(1-cyclohexenyl)ethyl]-N'-[2-(5-chloropyridyl)]-thiourea as potent inhibitors of multidrug-resistant human immunodeficiency virus-1. Bioorg Med Chem Lett9:2721-6 (1999) Reverse transcriptase/RNaseH
Name:Reverse transcriptase/RNaseH
Type:PROTEIN
Mol. Mass.:65229.15
Organism:Human immunodeficiency virus 1
Description:ChEMBL_1473730
Residue:566
BDBM1434
NameBDBM1434
Synonyms:11-cyclopropyl-5,11-dihydro-4-methyl-6H-dipyrido[3,2-b:2 ,3 -e][1,4]diazepin-6-one BI-RG-587 Nevirapine US11420959, Example NVP | Viramune
TypeSmall organic molecule
Emp. Form.C15H14N4O
Mol. Mass.266.2979
SMILESCc1ccnc2N(C3CC3)c3ncccc3C(=O)Nc12