Reaction Details
TargetCoagulation factor X
LigandBDBM50081499
Substrate/Competitorn/a
Meas. Tech.ChEBML_69683
Ki 2±n/a nM
Citation Becker, MREwing, WRDavis, RSPauls, HWLy, CLi, AMason, HJChoi-Sledeski, YMSpada, APChu, VBrown, KDColussi, DJLeadley, RJBentley, RBostwick, JKasiewski, CMorgan, S Synthesis, SAR and in vivo activity of novel thienopyridine sulfonamide pyrrolidinones as factor Xa inhibitors. Bioorg Med Chem Lett9:2753-8 (1999) Coagulation factor X
Name:Coagulation factor X
Type:Enzyme
Mol. Mass.:54726.60
Organism:Homo sapiens (Human)
Description:n/a
Residue:488
BDBM50081499
NameBDBM50081499
Synonyms:4-Hydroxy-3-[(S)-2-oxo-3-(thieno[2,3-c]pyridine-2-sulfonylamino)-pyrrolidin-1-ylmethyl]-benzamidine | CHEMBL92530
TypeSmall organic molecule
Emp. Form.C19H19N5O4S2
Mol. Mass.445.515
SMILESNC(=N)c1ccc(O)c(CN2CC[C@H](NS(=O)(=O)c3cc4ccncc4s3)C2=O)c1