Reaction Details
TargetCoagulation factor X
LigandBDBM13280
Substrate/Competitorn/a
Meas. Tech.ChEBML_69683
Ki 47±n/a nM
Citation Becker, MREwing, WRDavis, RSPauls, HWLy, CLi, AMason, HJChoi-Sledeski, YMSpada, APChu, VBrown, KDColussi, DJLeadley, RJBentley, RBostwick, JKasiewski, CMorgan, S Synthesis, SAR and in vivo activity of novel thienopyridine sulfonamide pyrrolidinones as factor Xa inhibitors. Bioorg Med Chem Lett9:2753-8 (1999) Coagulation factor X
Name:Coagulation factor X
Type:Enzyme
Mol. Mass.:54726.60
Organism:Homo sapiens (Human)
Description:n/a
Residue:488
BDBM13280
NameBDBM13280
Synonyms:3-{[(3S)-3-[(7-methoxynaphthalene-2-)sulfonamido]-2-oxopyrrolidin-1-yl]methyl}benzene-1-carboximidamide Sulfonamidopyrrolidinone 3a
TypeSmall organic molecule
Emp. Form.C23H24N4O4S
Mol. Mass.452.526
SMILESCOc1ccc2ccc(cc2c1)S(=O)(=O)N[C@H]1CCN(Cc2cccc(c2)C(N)=N)C1=O