Reaction Details
TargetProtein kinase C alpha type
LigandBDBM50081618
Substrate/Competitorn/a
Meas. Tech.ChEMBL_160286 (CHEMBL769614)
Ki 2720±n/a nM
Citation Lee, JKang, JHLee, SYHan, KCTorres, CMBhattacharyya, DKBlumberg, PMMarquez, VE Protein kinase C ligands based on tetrahydrofuran templates containing a new set of phorbol ester pharmacophores. J Med Chem42:4129-39 (1999) Protein kinase C alpha type
Name:Protein kinase C alpha type
Type:Enzyme
Mol. Mass.:76755.65
Organism:Homo sapiens (Human)
Description:The recombinant human PKC enzymes were produced using a baculovirus expression system in SF9 cells
Residue:672
BDBM50081618
NameBDBM50081618
Synonyms:CHEMBL131645 | Tetradecanoic acid (2R,5R)-2-hydroxymethyl-5-methoxycarbonylmethyl-tetrahydro-furan-2-ylmethyl ester
TypeSmall organic molecule
Emp. Form.C23H42O6
Mol. Mass.414.576
(=O)OC[C@]1(CO)CC[C@H](CC(=O)OC)O1