Reaction Details
TargetProtein kinase C alpha type
LigandBDBM50081615
Substrate/Competitorn/a
Meas. Tech.ChEMBL_160286 (CHEMBL769614)
Ki 350±n/a nM
Citation Lee, JKang, JHLee, SYHan, KCTorres, CMBhattacharyya, DKBlumberg, PMMarquez, VE Protein kinase C ligands based on tetrahydrofuran templates containing a new set of phorbol ester pharmacophores. J Med Chem42:4129-39 (1999) Protein kinase C alpha type
Name:Protein kinase C alpha type
Type:Enzyme
Mol. Mass.:76755.65
Organism:Homo sapiens (Human)
Description:The recombinant human PKC enzymes were produced using a baculovirus expression system in SF9 cells
Residue:672
BDBM50081615
NameBDBM50081615
Synonyms:CHEMBL133165 | Tetradecanoic acid 2-hydroxymethyl-4-[1-methoxycarbonyl-meth-(E)-ylidene]-tetrahydro-furan-2-ylmethyl ester
TypeSmall organic molecule
Emp. Form.C23H40O6
Mol. Mass.412.5601
(=O)OCC1(CO)C\C(CO1)=C/C(=O)OC