Reaction Details
TargetReverse transcriptase/RNaseH
LigandBDBM50081624
Substrate/Competitorn/a
Meas. Tech.ChEMBL_195666 (CHEMBL800661)
IC50 6800±n/a nM
Citation Genin, MJPoel, TJMay, PDKopta, LAYagi, YOlmsted, RAFriis, JMVoorman, RLAdams, WJThomas, RCRomero, DL Synthesis and structure-activity relationships of the (alkylamino)piperidine-containing BHAP class of non-nucleoside reverse transcriptase inhibitors: effect of 3-alkylpyridine ring substitution. J Med Chem42:4140-9 (1999) Reverse transcriptase/RNaseH
Name:Reverse transcriptase/RNaseH
Type:PROTEIN
Mol. Mass.:65229.15
Organism:Human immunodeficiency virus 1
Description:ChEMBL_1473730
Residue:566
BDBM50081624
NameBDBM50081624
Synonyms:CHEMBL132491 | N-(2-{4-[(3-Methoxymethyl-pyridin-2-yl)-methyl-amino]-piperidine-1-carbonyl}-1H-indol-5-yl)-methanesulfonamide
TypeSmall organic molecule
Emp. Form.C23H29N5O4S
Mol. Mass.471.572
SMILESCOCc1cccnc1N(C)C1CCN(CC1)C(=O)c1cc2cc(NS(C)(=O)=O)ccc2[nH]1