Reaction Details
TargetDihydrofolate reductase
LigandBDBM18069
Substrate/Competitorn/a
Meas. Tech.ChEMBL_53606 (CHEMBL664357)
Ki 1000±n/a nM
Citation Chowdhury, SFVillamor, VBGuerrero, RHLeal, IBrun, RCroft, SLGoodman, JMMaes, LRuiz-Perez, LMPacanowska, DGGilbert, IH Design, synthesis, and evaluation of inhibitors of trypanosomal and leishmanial dihydrofolate reductase. J Med Chem42:4300-12 (1999) Dihydrofolate reductase
Name:Dihydrofolate reductase
Type:Enzyme
Mol. Mass.:21453.99
Organism:Homo sapiens (Human)
Description:Recombinant human DHFR.
Residue:187
BDBM18069
NameBDBM18069
Synonyms:5-[(3,4,5-trimethoxyphenyl)methyl]pyrimidine-2,4-diamine TMP Trimethoprim (TMP) | US10870625, Compound TMP
TypeSmall organic molecule
Emp. Form.C14H18N4O3
Mol. Mass.290.3177
SMILESCOc1cc(Cc2cnc(N)nc2N)cc(OC)c1OC