Reaction Details
TargetDihydrofolate reductase
LigandBDBM50081915
Substrate/Competitorn/a
Meas. Tech.ChEMBL_53497 (CHEMBL665621)
Ki 13±n/a nM
Citation Chowdhury, SFVillamor, VBGuerrero, RHLeal, IBrun, RCroft, SLGoodman, JMMaes, LRuiz-Perez, LMPacanowska, DGGilbert, IH Design, synthesis, and evaluation of inhibitors of trypanosomal and leishmanial dihydrofolate reductase. J Med Chem42:4300-12 (1999) Dihydrofolate reductase
Name:Dihydrofolate reductase
Type:Enzyme
Mol. Mass.:21453.99
Organism:Homo sapiens (Human)
Description:Recombinant human DHFR.
Residue:187
BDBM50081915
NameBDBM50081915
Synonyms:5-[3-(Tetrahydro-pyran-2-yloxy)-benzyl]-pyrimidine-2,4-diamine | CHEMBL344592
TypeSmall organic molecule
Emp. Form.C16H20N4O2
Mol. Mass.300.3556
SMILESNc1ncc(Cc2cccc(OC3CCCCO3)c2)c(N)n1