Reaction Details
TargetDihydrofolate reductase
LigandBDBM50081922
Substrate/Competitorn/a
Meas. Tech.ChEMBL_53606 (CHEMBL664357)
Ki 23±n/a nM
Citation Chowdhury, SFVillamor, VBGuerrero, RHLeal, IBrun, RCroft, SLGoodman, JMMaes, LRuiz-Perez, LMPacanowska, DGGilbert, IH Design, synthesis, and evaluation of inhibitors of trypanosomal and leishmanial dihydrofolate reductase. J Med Chem42:4300-12 (1999) Dihydrofolate reductase
Name:Dihydrofolate reductase
Type:Enzyme
Mol. Mass.:21453.99
Organism:Homo sapiens (Human)
Description:Recombinant human DHFR.
Residue:187
BDBM50081922
NameBDBM50081922
Synonyms:5-(3-Isopropoxy-benzyl)-pyrimidine-2,4-diamine | CHEMBL334919
TypeSmall organic molecule
Emp. Form.C14H18N4O
Mol. Mass.258.3189
SMILESCC(C)Oc1cccc(Cc2cnc(N)nc2N)c1