Reaction Details
TargetReverse transcriptase/RNaseH
LigandBDBM50052046
Substrate/Competitorn/a
Meas. Tech.ChEMBL_196184 (CHEMBL801172)
Ki 190±n/a nM
Citation Campiani, GMorelli, EFabbrini, MNacci, VGreco, GNovellino, ERamunno, AMaga, GSpadari, SCaliendo, GBergamini, AFaggioli, EUccella, IBolacchi, FMarini, SColetta, MNacca, ACaccia, S Pyrrolobenzoxazepinone derivatives as non-nucleoside HIV-1 RT inhibitors: further structure-activity relationship studies and identification of more potent broad-spectrum HIV-1 RT inhibitors with antiviral activity. J Med Chem42:4462-70 (1999) Reverse transcriptase/RNaseH
Name:Reverse transcriptase/RNaseH
Type:PROTEIN
Mol. Mass.:65229.15
Organism:Human immunodeficiency virus 1
Description:ChEMBL_1473730
Residue:566
BDBM50052046
NameBDBM50052046
Synonyms:5-Ethyl-5-phenyl-6-oxa-10b-aza-benzo[e]azulen-4-one | CHEMBL329653
TypeSmall organic molecule
Emp. Form.C20H17NO2
Mol. Mass.303.3545
SMILESCCC1(Oc2ccccc2-n2cccc2C1=O)c1ccccc1