Reaction Details
TargetReverse transcriptase/RNaseH
LigandBDBM50082056
Substrate/Competitorn/a
Meas. Tech.ChEMBL_196182 (CHEMBL801170)
Ki 430±n/a nM
Citation Campiani, GMorelli, EFabbrini, MNacci, VGreco, GNovellino, ERamunno, AMaga, GSpadari, SCaliendo, GBergamini, AFaggioli, EUccella, IBolacchi, FMarini, SColetta, MNacca, ACaccia, S Pyrrolobenzoxazepinone derivatives as non-nucleoside HIV-1 RT inhibitors: further structure-activity relationship studies and identification of more potent broad-spectrum HIV-1 RT inhibitors with antiviral activity. J Med Chem42:4462-70 (1999) Reverse transcriptase/RNaseH
Name:Reverse transcriptase/RNaseH
Type:PROTEIN
Mol. Mass.:65229.15
Organism:Human immunodeficiency virus 1
Description:ChEMBL_1473730
Residue:566
BDBM50082056
NameBDBM50082056
Synonyms:5-Ethyl-5-thiophen-2-yl-6-oxa-10,10b-diaza-benzo[e]azulen-4-one | CHEMBL138969
TypeSmall organic molecule
Emp. Form.C17H14N2O2S
Mol. Mass.310.37
SMILESCCC1(Oc2cccnc2-n2cccc2C1=O)c1cccs1