Reaction Details
TargetReverse transcriptase/RNaseH
LigandBDBM50082055
Substrate/Competitorn/a
Meas. Tech.ChEMBL_196180 (CHEMBL804953)
Ki 44±n/a nM
Citation Campiani, GMorelli, EFabbrini, MNacci, VGreco, GNovellino, ERamunno, AMaga, GSpadari, SCaliendo, GBergamini, AFaggioli, EUccella, IBolacchi, FMarini, SColetta, MNacca, ACaccia, S Pyrrolobenzoxazepinone derivatives as non-nucleoside HIV-1 RT inhibitors: further structure-activity relationship studies and identification of more potent broad-spectrum HIV-1 RT inhibitors with antiviral activity. J Med Chem42:4462-70 (1999) Reverse transcriptase/RNaseH
Name:Reverse transcriptase/RNaseH
Type:PROTEIN
Mol. Mass.:65229.15
Organism:Human immunodeficiency virus 1
Description:ChEMBL_1473730
Residue:566
BDBM50082055
NameBDBM50082055
Synonyms:5-Ethyl-5-m-tolyl-6-oxa-10,10b-diaza-benzo[e]azulen-4-one | CHEMBL336441
TypeSmall organic molecule
Emp. Form.C20H18N2O2
Mol. Mass.318.3691
SMILESCCC1(Oc2cccnc2-n2cccc2C1=O)c1cccc(C)c1