Reaction Details
TargetAnionic trypsin
LigandBDBM50082174
Substrate/Competitorn/a
Meas. Tech.ChEBML_212167
Ki 360±n/a nM
Citation Stürzebecher, JVieweg, HSteinmetzer, TSchweinitz, AStubbs, MTRenatus, MWikström, P 3-Amidinophenylalanine-based inhibitors of urokinase. Bioorg Med Chem Lett9:3147-52 (1999) Anionic trypsin
Name:Anionic trypsin
Type:PROTEIN
Mol. Mass.:26281.39
Organism:Bos taurus
Description:ChEMBL_212177
Residue:247
BDBM50082174
NameBDBM50082174
Synonyms:1-[3-(3-Carbamimidoyl-phenyl)-2-(2,4,6-triisopropyl-benzenesulfonylamino)-propionyl]-piperidine-3-carboxylic acid methyl ester | CHEMBL108058
TypeSmall organic molecule
Emp. Form.C32H46N4O5S
Mol. Mass.598.796
SMILESCOC(=O)C1CCCN(C1)C(=O)C(Cc1cccc(c1)C(N)=N)NS(=O)(=O)c1c(cc(cc1C(C)C)C(C)C)C(C)C