Reaction Details
TargetAnionic trypsin
LigandBDBM50082180
Substrate/Competitorn/a
Meas. Tech.ChEBML_212167
Ki 610±n/a nM
Citation Stürzebecher, JVieweg, HSteinmetzer, TSchweinitz, AStubbs, MTRenatus, MWikström, P 3-Amidinophenylalanine-based inhibitors of urokinase. Bioorg Med Chem Lett9:3147-52 (1999) Anionic trypsin
Name:Anionic trypsin
Type:PROTEIN
Mol. Mass.:26281.39
Organism:Bos taurus
Description:ChEMBL_212177
Residue:247
BDBM50082180
NameBDBM50082180
Synonyms:3-[3-Azocan-1-yl-2-(naphthalene-2-sulfonylamino)-3-oxo-propyl]-benzamidine | CHEMBL107256
TypeSmall organic molecule
Emp. Form.C27H32N4O3S
Mol. Mass.492.633
SMILESNC(=N)c1cccc(CC(NS(=O)(=O)c2ccc3ccccc3c2)C(=O)N2CCCCCCC2)c1