Reaction Details
TargetAnionic trypsin
LigandBDBM50082187
Substrate/Competitorn/a
Meas. Tech.ChEBML_212167
Ki 790.0±n/a nM
Citation Stürzebecher, JVieweg, HSteinmetzer, TSchweinitz, AStubbs, MTRenatus, MWikström, P 3-Amidinophenylalanine-based inhibitors of urokinase. Bioorg Med Chem Lett9:3147-52 (1999) Anionic trypsin
Name:Anionic trypsin
Type:PROTEIN
Mol. Mass.:26281.39
Organism:Bos taurus
Description:ChEMBL_212177
Residue:247
BDBM50082187
NameBDBM50082187
Synonyms:1-[3-(3-Carbamimidoyl-phenyl)-2-(2,4,6-triisopropyl-benzenesulfonylamino)-propionyl]-piperidine-3-carboxylic acid methylamide | CHEMBL110628
TypeSmall organic molecule
Emp. Form.C32H47N5O4S
Mol. Mass.597.812
SMILESCNC(=O)C1CCCN(C1)C(=O)C(Cc1cccc(c1)C(N)=N)NS(=O)(=O)c1c(cc(cc1C(C)C)C(C)C)C(C)C