Reaction Details
TargetCoagulation factor X
LigandBDBM23891
Substrate/Competitorn/a
Meas. Tech.ChEBML_48478
Ki 1700±n/a nM
Citation Stürzebecher, JVieweg, HSteinmetzer, TSchweinitz, AStubbs, MTRenatus, MWikström, P 3-Amidinophenylalanine-based inhibitors of urokinase. Bioorg Med Chem Lett9:3147-52 (1999) Coagulation factor X
Name:Coagulation factor X
Type:PROTEIN
Mol. Mass.:54498.45
Organism:Bos taurus
Description:ChEMBL_1364435
Residue:492
BDBM23891
NameBDBM23891
Synonyms:3-amidinophenylalanine deriv., 35 ethyl 4-[(2S)-3-(3-carbamimidoylphenyl)-2-{[2,4,6-tris(propan-2-yl)benzene]sulfonamido}propanoyl]piperazine-1-carboxylate
TypeSmall organic molecule
Emp. Form.C32H47N5O5S
Mol. Mass.613.811
SMILESCCOC(=O)N1CCN(CC1)C(=O)[C@H](Cc1cccc(c1)C(N)=N)NS(=O)(=O)c1c(cc(cc1C(C)C)C(C)C)C(C)C