Reaction Details
TargetAnionic trypsin
LigandBDBM50082179
Substrate/Competitorn/a
Meas. Tech.ChEBML_212167
Ki 500±n/a nM
Citation Stürzebecher, JVieweg, HSteinmetzer, TSchweinitz, AStubbs, MTRenatus, MWikström, P 3-Amidinophenylalanine-based inhibitors of urokinase. Bioorg Med Chem Lett9:3147-52 (1999) Anionic trypsin
Name:Anionic trypsin
Type:PROTEIN
Mol. Mass.:26281.39
Organism:Bos taurus
Description:ChEMBL_212177
Residue:247
BDBM50082179
NameBDBM50082179
Synonyms:1-[3-(3-Carbamimidoyl-phenyl)-2-(2,4,6-triisopropyl-benzenesulfonylamino)-propionyl]-piperidine-2-carboxylic acid | CHEMBL106395
TypeSmall organic molecule
Emp. Form.C31H44N4O5S
Mol. Mass.584.77
SMILESCC(C)c1cc(C(C)C)c(c(c1)C(C)C)S(=O)(=O)NC(Cc1cccc(c1)C(N)=N)C(=O)N1CCCCC1C(O)=O