Reaction Details
TargetAnionic trypsin
LigandBDBM50072857
Substrate/Competitorn/a
Meas. Tech.ChEBML_212167
Ki 690.0±n/a nM
Citation Stürzebecher, JVieweg, HSteinmetzer, TSchweinitz, AStubbs, MTRenatus, MWikström, P 3-Amidinophenylalanine-based inhibitors of urokinase. Bioorg Med Chem Lett9:3147-52 (1999) Anionic trypsin
Name:Anionic trypsin
Type:PROTEIN
Mol. Mass.:26281.39
Organism:Bos taurus
Description:ChEMBL_212177
Residue:247
BDBM50072857
NameBDBM50072857
Synonyms:3-[3-(4-Methyl-piperidin-1-yl)-3-oxo-2-(2,4,6-triisopropyl-benzenesulfonylamino)-propyl]-benzamidine | CHEMBL106079
TypeSmall organic molecule
Emp. Form.C31H46N4O3S
Mol. Mass.554.787
SMILESCC(C)c1cc(C(C)C)c(c(c1)C(C)C)S(=O)(=O)NC(Cc1cccc(c1)C(N)=N)C(=O)N1CCC(C)CC1