Reaction Details
TargetPlasminogen
LigandBDBM50082192
Substrate/Competitorn/a
Meas. Tech.ChEBML_155241
Ki 2500±n/a nM
Citation Stürzebecher, JVieweg, HSteinmetzer, TSchweinitz, AStubbs, MTRenatus, MWikström, P 3-Amidinophenylalanine-based inhibitors of urokinase. Bioorg Med Chem Lett9:3147-52 (1999) Plasminogen
Name:Plasminogen
Type:Enzyme
Mol. Mass.:90579.18
Organism:Homo sapiens (Human)
Description:n/a
Residue:810
BDBM50082192
NameBDBM50082192
Synonyms:1-[3-(3-Carbamimidoyl-phenyl)-2-(2,4,6-triisopropyl-benzenesulfonylamino)-propionyl]-piperidine-4-carboxylic acid methylamide | CHEMBL108354
TypeSmall organic molecule
Emp. Form.C32H47N5O4S
Mol. Mass.597.812
SMILESCNC(=O)C1CCN(CC1)C(=O)C(Cc1cccc(c1)C(N)=N)NS(=O)(=O)c1c(cc(cc1C(C)C)C(C)C)C(C)C