Reaction Details
TargetMatrix metalloproteinase-9
LigandBDBM50082226
Substrate/Competitorn/a
Meas. Tech.ChEBML_105820
IC50 640±n/a nM
Citation Bailey, SBolognese, BFaller, ALouis-Flamberg, PMacPherson, DTMayer, RJMarshall, LAMilner, PHMistry, JSmith, DGWard, JG Selective inhibition of low affinity IgE receptor (CD23) processing: P1' bicyclomethyl substituents. Bioorg Med Chem Lett9:3165-70 (1999) Matrix metalloproteinase-9
Name:Matrix metalloproteinase-9
Type:Enzyme
Mol. Mass.:78452.28
Organism:Homo sapiens (Human)
Description:P14780
Residue:707
BDBM50082226
NameBDBM50082226
Synonyms:(2R,3S)-N*4*-((S)-1-Carbamoyl-2,2-dimethyl-propyl)-2,N*1*-dihydroxy-3-naphthalen-2-ylmethyl-succinamide | CHEMBL432583
TypeSmall organic molecule
Emp. Form.C21H27N3O5
Mol. Mass.401.4562
SMILESCC(C)(C)[C@H](NC(=O)[C@H](Cc1ccc2ccccc2c1)[C@H](O)C(=O)NO)C(N)=O