Reaction Details
TargetStromelysin-1
LigandBDBM50403718
Substrate/Competitorn/a
Meas. Tech.ChEBML_105818
IC50 230±n/a nM
Citation Bailey, SBolognese, BFaller, ALouis-Flamberg, PMacPherson, DTMayer, RJMarshall, LAMilner, PHMistry, JSmith, DGWard, JG Selective inhibition of low affinity IgE receptor (CD23) processing: P1' bicyclomethyl substituents. Bioorg Med Chem Lett9:3165-70 (1999) Stromelysin-1
Name:Stromelysin-1
Type:Enzyme
Mol. Mass.:53973.13
Organism:Homo sapiens (Human)
Description: P08254
Residue:477
BDBM50403718
NameBDBM50403718
Synonyms:CHEMBL2112477
TypeSmall organic molecule
Emp. Form.C21H31N3O5
Mol. Mass.405.4879
SMILESCC(C)(C)[C@H](NC(=O)C(C[C@H]1CCc2ccccc2C1)[C@H](O)C(=O)NO)C(N)=O