Reaction Details
TargetLow affinity immunoglobulin epsilon Fc receptor
LigandBDBM50082230
Substrate/Competitorn/a
Meas. Tech.ChEBML_88888
IC50>1000±n/a nM
Citation Bailey, SBolognese, BFaller, ALouis-Flamberg, PMacPherson, DTMayer, RJMarshall, LAMilner, PHMistry, JSmith, DGWard, JG Selective inhibition of low affinity IgE receptor (CD23) processing: P1' bicyclomethyl substituents. Bioorg Med Chem Lett9:3165-70 (1999) Low affinity immunoglobulin epsilon Fc receptor
Name:Low affinity immunoglobulin epsilon Fc receptor
Type:PROTEIN
Mol. Mass.:36461.84
Organism:Homo sapiens (Human)
Description:ChEMBL_88888
Residue:321
BDBM50082230
NameBDBM50082230
Synonyms:(2R,3S)-N*1*-((S)-1-Carbamoyl-2,2-dimethyl-propyl)-2-(6,7-difluoro-naphthalen-2-ylmethyl)-3,N*4*-dihydroxy-succinamide | CHEMBL110617
TypeSmall organic molecule
Emp. Form.C21H25F2N3O5
Mol. Mass.437.4371
SMILESCC(C)(C)[C@H](NC(=O)[C@H](Cc1ccc2cc(F)c(F)cc2c1)[C@H](O)C(=O)NO)C(N)=O