Reaction Details
TargetLow affinity immunoglobulin epsilon Fc receptor
LigandBDBM50082231
Substrate/Competitorn/a
Meas. Tech.ChEBML_88888
IC50>1000±n/a nM
Citation Bailey, SBolognese, BFaller, ALouis-Flamberg, PMacPherson, DTMayer, RJMarshall, LAMilner, PHMistry, JSmith, DGWard, JG Selective inhibition of low affinity IgE receptor (CD23) processing: P1' bicyclomethyl substituents. Bioorg Med Chem Lett9:3165-70 (1999) Low affinity immunoglobulin epsilon Fc receptor
Name:Low affinity immunoglobulin epsilon Fc receptor
Type:PROTEIN
Mol. Mass.:36461.84
Organism:Homo sapiens (Human)
Description:ChEMBL_88888
Residue:321
BDBM50082231
NameBDBM50082231
Synonyms:(2R,3S)-2-Benzo[b]thiophen-3-ylmethyl-3,N*4*-dihydroxy-N*1*-((S)-1-methylcarbamoyl-2-phenyl-ethyl)-succinamide | CHEMBL321288
TypeSmall organic molecule
Emp. Form.C23H25N3O5S
Mol. Mass.455.527
SMILESCNC(=O)[C@H](Cc1ccccc1)NC(=O)[C@H](Cc1csc2ccccc12)[C@H](O)C(=O)NO