Reaction Details
TargetInterstitial collagenase
LigandBDBM50082229
Substrate/Competitorn/a
Meas. Tech.ChEBML_105816
IC50>1000±n/a nM
Citation Bailey, SBolognese, BFaller, ALouis-Flamberg, PMacPherson, DTMayer, RJMarshall, LAMilner, PHMistry, JSmith, DGWard, JG Selective inhibition of low affinity IgE receptor (CD23) processing: P1' bicyclomethyl substituents. Bioorg Med Chem Lett9:3165-70 (1999) Interstitial collagenase
Name:Interstitial collagenase
Type:Enzyme
Mol. Mass.:54010.26
Organism:Homo sapiens (Human)
Description: P03956
Residue:469
BDBM50082229
NameBDBM50082229
Synonyms:(2R,3S)-N*4*-((S)-2,2-Dimethyl-1-methylcarbamoyl-propyl)-2,N*1*-dihydroxy-3-naphthalen-2-ylmethyl-succinamide | CHEMBL108737
TypeSmall organic molecule
Emp. Form.C22H29N3O5
Mol. Mass.415.4828
SMILESCNC(=O)[C@@H](NC(=O)[C@H](Cc1ccc2ccccc2c1)[C@H](O)C(=O)NO)C(C)(C)C