Reaction Details
TargetLow affinity immunoglobulin epsilon Fc receptor
LigandBDBM50082227
Substrate/Competitorn/a
Meas. Tech.ChEBML_88888
IC50 320±n/a nM
Citation Bailey, SBolognese, BFaller, ALouis-Flamberg, PMacPherson, DTMayer, RJMarshall, LAMilner, PHMistry, JSmith, DGWard, JG Selective inhibition of low affinity IgE receptor (CD23) processing: P1' bicyclomethyl substituents. Bioorg Med Chem Lett9:3165-70 (1999) Low affinity immunoglobulin epsilon Fc receptor
Name:Low affinity immunoglobulin epsilon Fc receptor
Type:PROTEIN
Mol. Mass.:36461.84
Organism:Homo sapiens (Human)
Description:ChEMBL_88888
Residue:321
BDBM50082227
NameBDBM50082227
Synonyms:(2R,3S)-2-Benzothiazol-2-ylmethyl-N*1*-((S)-1-carbamoyl-2-phenyl-ethyl)-3,N*4*-dihydroxy-succinamide | CHEMBL110667
TypeSmall organic molecule
Emp. Form.C21H22N4O5S
Mol. Mass.442.488
SMILESNC(=O)[C@H](Cc1ccccc1)NC(=O)[C@H](Cc1nc2ccccc2s1)[C@H](O)C(=O)NO