Reaction Details
TargetThromboxane A2 receptor
LigandBDBM50082313
Substrate/Competitorn/a
Meas. Tech.ChEBML_209602
Ki 625±n/a nM
Citation Halmos, TTurek, JWLe Breton, GCAntonakis, K Synthesis and biological characterization of sqbazide, a novel biotinylated photoaffinity probe for the study of the human platelet thromboxane A2 receptor. Bioorg Med Chem Lett9:2963-8 (1999) Thromboxane A2 receptor
Name:Thromboxane A2 receptor
Type:Enyzme
Mol. Mass.:37445.28
Organism:Homo sapiens (Human)
Description:P21731
Residue:343
BDBM50082313
NameBDBM50082313
Synonyms:4-(4-Azido-phenyl)-N-({[3-((Z)-7-oxo-7-{N'-[5-((3aS,6R,6aR)-2-oxo-hexahydro-thieno[3,4-d]imidazol-6-yl)-pentanoyl]-hydrazino}-hept-2-enyl)-7-oxa-bicyclo[2.2.1]hept-2-ylmethyl]-carbamoyl}-methyl)-butyramide | CHEMBL99695
TypeSmall organic molecule
Emp. Form.C36H51N9O6S
Mol. Mass.737.912
SMILES[N-]=[N+]=Nc1ccc(CCCC(=O)NCC(=O)NCC2C3CCC(O3)C2C\C=C/CCCC(=O)NNC(=O)CCCC[C@H]2SC[C@H]3NC(=O)N[C@@H]23)cc1