Reaction Details
TargetMuscarinic acetylcholine receptor M1
LigandBDBM50082338
Substrate/Competitorn/a
Meas. Tech.ChEBML_139954
IC50 650±n/a nM
Citation Novelli, FSparatore, ATasso, BSparatore, F Quinolizidinyl derivatives of 5,11-dihydro-6H-pyrido[2,3-b][1,4]benzodiazepin-6-one as ligands for muscarinic receptors. Bioorg Med Chem Lett9:3031-4 (1999) Muscarinic acetylcholine receptor M1
Name:Muscarinic acetylcholine receptor M1
Type:Enzyme Catalytic Domain
Mol. Mass.:51390.46
Organism:RAT
Description:P08482
Residue:460
BDBM50082338
NameBDBM50082338
Synonyms:11-(2-Octahydro-quinolizin-1-yl-acetyl)-6,11-dihydro-benzo[b]pyrido[2,3-e][1,4]diazepin-5-one | CHEMBL103529
TypeSmall organic molecule
Emp. Form.C23H26N4O2
Mol. Mass.390.4781
SMILESO=C(CC1CCCN2CCCCC12)N1c2ccccc2NC(=O)c2cccnc12