Reaction Details
TargetType-1 angiotensin II receptor A
LigandBDBM50082568
Substrate/Competitorn/a
Meas. Tech.ChEMBL_35127 (CHEMBL648490)
Ki 1.5±n/a nM
Citation Nouet, SDodey, PRBondoux, MRPruneau, DLuccarini, JMGroblewski, TLarguier, RLombard, CMarie, JRenaut, PPLeclerc, GBonnafous, JC Specific nonpeptide photoprobes as tools for the structural study of the angiotensin II AT(1) receptor. J Med Chem42:4572-83 (1999) Type-1 angiotensin II receptor A
Name:Type-1 angiotensin II receptor A
Type:Enzyme Catalytic Domain
Mol. Mass.:40910.53
Organism:RAT
Description:ANGIOTENSIN AT1 AGTR1 RAT::P25095
Residue:359
BDBM50082568
NameBDBM50082568
Synonyms:2-({3-[4-(2-Azido-benzenesulfonylaminocarbonyl)-benzyl]-2-butyl-3H-imidazol-4-ylmethyl}-amino)-benzoic acid | CHEMBL143118
TypeSmall organic molecule
Emp. Form.C29H29N7O5S
Mol. Mass.587.649
SMILESCCCCc1ncc(CNc2ccccc2C(O)=O)n1Cc1ccc(cc1)C(=O)NS(=O)(=O)c1ccccc1N=[N+]=[N-]