Reaction Details
TargetSigma non-opioid intracellular receptor 1
LigandBDBM50082625
Substrate/Competitorn/a
Meas. Tech.ChEMBL_201431 (CHEMBL809834)
Ki 0.96±n/a nM
Citation Carroll, FIBai, XDehghani, AMascarella, SWWilliams, WBowen, WD Asymmetric synthesis of 9-alkyl-2-benzyl-6,7-benzomorphans: characterization as novel sigma receptor ligands. J Med Chem42:4621-9 (1999) Sigma non-opioid intracellular receptor 1
Name:Sigma non-opioid intracellular receptor 1
Type:Enzyme Catalytic Domain
Mol. Mass.:25124.85
Organism:Homo sapiens (Human)
Description:Q99720
Residue:223
BDBM50082625
NameBDBM50082625
Synonyms:(2R,6R,11R)-3-Benzyl-11-methyl-1,2,3,4,5,6-hexahydro-2,6-methano-benzo[d]azocine | CHEMBL140618
TypeSmall organic molecule
Emp. Form.C20H23N
Mol. Mass.277.4033
SMILESC[C@H]1[C@H]2Cc3ccccc3[C@@H]1CCN2Cc1ccccc1