Reaction Details
TargetAlpha-1A adrenergic receptor
LigandBDBM50082822
Substrate/Competitorn/a
Meas. Tech.ChEMBL_33740 (CHEMBL647055)
Ki 1.1±n/a nM
Citation Murali Dhar, TGNagarathnam, DMarzabadi, MRLagu, BWong, WCChiu, GTyagarajan, SMiao, SWZhang, FSun, WTian, DShen, QZhang, JWetzel, JMForray, CChang, RSBroten, TPSchorn, TWChen, TBO'Malley, SRansom, RSchneck, KBendesky, RHarrell, CMVyas, KP Design and synthesis of novel alpha(1)(a) adrenoceptor-selective antagonists. 2. Approaches to eliminate opioid agonist metabolites via modification of linker and 4-methoxycarbonyl-4-phenylpiperidine moiety. J Med Chem42:4778-93 (1999) Alpha-1A adrenergic receptor
Name:Alpha-1A adrenergic receptor
Type:Cell-surface receptors
Mol. Mass.:51511.67
Organism:Homo sapiens (Human)
Description:P35348
Residue:466
BDBM50082822
NameBDBM50082822
Synonyms:CHEMBL424494 | methyl 4-(3,4-difluorophenyl)-6-methyl-2-oxo-3-[3-spiro[2,3-dihydro-1H-indene-1,4'-(hexahydropyridine)]-1-ylpropylcarbamoyl]-1,2,3,4-tetrahydro-5-pyrimidinecarboxylate
TypeSmall organic molecule
Emp. Form.C30H34F2N4O4
Mol. Mass.552.6122
SMILESCOC(=O)C1=C(C)NC(=O)N(C1c1ccc(F)c(F)c1)C(=O)NCCCN1CCC2(CCc3ccccc23)CC1