Reaction Details
TargetAlpha-1A adrenergic receptor
LigandBDBM50082808
Substrate/Competitorn/a
Meas. Tech.ChEMBL_33740 (CHEMBL647055)
Ki 0.5±n/a nM
Citation Murali Dhar, TGNagarathnam, DMarzabadi, MRLagu, BWong, WCChiu, GTyagarajan, SMiao, SWZhang, FSun, WTian, DShen, QZhang, JWetzel, JMForray, CChang, RSBroten, TPSchorn, TWChen, TBO'Malley, SRansom, RSchneck, KBendesky, RHarrell, CMVyas, KP Design and synthesis of novel alpha(1)(a) adrenoceptor-selective antagonists. 2. Approaches to eliminate opioid agonist metabolites via modification of linker and 4-methoxycarbonyl-4-phenylpiperidine moiety. J Med Chem42:4778-93 (1999) Alpha-1A adrenergic receptor
Name:Alpha-1A adrenergic receptor
Type:Cell-surface receptors
Mol. Mass.:51511.67
Organism:Homo sapiens (Human)
Description:P35348
Residue:466
BDBM50082808
NameBDBM50082808
Synonyms:4-(3,4-Difluoro-phenyl)-6-methoxymethyl-3-[3-(4-methyl-4-phenyl-piperidin-1-yl)-propylcarbamoyl]-2-oxo-1,2,3,4-tetrahydro-pyrimidine-5-carboxylic acid methyl ester | CHEMBL142243
TypeSmall organic molecule
Emp. Form.C30H36F2N4O5
Mol. Mass.570.6274
SMILESCOCC1=C(C(N(C(=O)NCCCN2CCC(C)(CC2)c2ccccc2)C(=O)N1)c1ccc(F)c(F)c1)C(=O)OC