Reaction Details
TargetAlpha-1A adrenergic receptor
LigandBDBM50082823
Substrate/Competitorn/a
Meas. Tech.ChEMBL_33740 (CHEMBL647055)
Ki 0.3±n/a nM
Citation Murali Dhar, TGNagarathnam, DMarzabadi, MRLagu, BWong, WCChiu, GTyagarajan, SMiao, SWZhang, FSun, WTian, DShen, QZhang, JWetzel, JMForray, CChang, RSBroten, TPSchorn, TWChen, TBO'Malley, SRansom, RSchneck, KBendesky, RHarrell, CMVyas, KP Design and synthesis of novel alpha(1)(a) adrenoceptor-selective antagonists. 2. Approaches to eliminate opioid agonist metabolites via modification of linker and 4-methoxycarbonyl-4-phenylpiperidine moiety. J Med Chem42:4778-93 (1999) Alpha-1A adrenergic receptor
Name:Alpha-1A adrenergic receptor
Type:Cell-surface receptors
Mol. Mass.:51511.67
Organism:Homo sapiens (Human)
Description:P35348
Residue:466
BDBM50082823
NameBDBM50082823
Synonyms:CHEMBL145170 | methyl 4-(3,4-difluorophenyl)-6-methyl-2-oxo-3-[3-spiro[1,3-dihydroisobenzofuran-1,4'-(hexahydropyridine)]-1-ylpropylcarbamoyl]-1,2,3,4-tetrahydro-5-pyrimidinecarboxylate
TypeSmall organic molecule
Emp. Form.C29H32F2N4O5
Mol. Mass.554.585
SMILESCOC(=O)C1=C(C)NC(=O)N(C1c1ccc(F)c(F)c1)C(=O)NCCCN1CCC2(CC1)OCc1ccccc21