Reaction Details
TargetAlpha-1D adrenergic receptor
LigandBDBM29568
Substrate/Competitorn/a
Meas. Tech.ChEMBL_32452 (CHEMBL643400)
Ki 0.3±n/a nM
Citation Murali Dhar, TGNagarathnam, DMarzabadi, MRLagu, BWong, WCChiu, GTyagarajan, SMiao, SWZhang, FSun, WTian, DShen, QZhang, JWetzel, JMForray, CChang, RSBroten, TPSchorn, TWChen, TBO'Malley, SRansom, RSchneck, KBendesky, RHarrell, CMVyas, KP Design and synthesis of novel alpha(1)(a) adrenoceptor-selective antagonists. 2. Approaches to eliminate opioid agonist metabolites via modification of linker and 4-methoxycarbonyl-4-phenylpiperidine moiety. J Med Chem42:4778-93 (1999) Alpha-1D adrenergic receptor
Name:Alpha-1D adrenergic receptor
Type:Enzyme Catalytic Domain
Mol. Mass.:60485.82
Organism:Homo sapiens (Human)
Description:adrenergic Alpha1D ADRA1D HUMAN::P25100
Residue:572
BDBM29568
NameBDBM29568
Synonyms:CHEMBL2 PRAZOSIN HYDROCHLORIDE [3H]-Minipress [3H]-Prazosin
Typeradiolabeled ligand
Emp. Form.C19H21N5O4
Mol. Mass.383.4011
SMILESCOc1cc2nc(nc(N)c2cc1OC)N1CCN(CC1)C(=O)c1ccco1