Reaction Details
TargetAlpha-1A adrenergic receptor
LigandBDBM50082820
Substrate/Competitorn/a
Meas. Tech.ChEMBL_33740 (CHEMBL647055)
Ki 1.7±n/a nM
Citation Murali Dhar, TGNagarathnam, DMarzabadi, MRLagu, BWong, WCChiu, GTyagarajan, SMiao, SWZhang, FSun, WTian, DShen, QZhang, JWetzel, JMForray, CChang, RSBroten, TPSchorn, TWChen, TBO'Malley, SRansom, RSchneck, KBendesky, RHarrell, CMVyas, KP Design and synthesis of novel alpha(1)(a) adrenoceptor-selective antagonists. 2. Approaches to eliminate opioid agonist metabolites via modification of linker and 4-methoxycarbonyl-4-phenylpiperidine moiety. J Med Chem42:4778-93 (1999) Alpha-1A adrenergic receptor
Name:Alpha-1A adrenergic receptor
Type:Cell-surface receptors
Mol. Mass.:51511.67
Organism:Homo sapiens (Human)
Description:P35348
Residue:466
BDBM50082820
NameBDBM50082820
Synonyms:1'-[5-Methoxycarbonyl-4-methoxymethyl-2-oxo-6-(3,4,5-trifluoro-phenyl)-3,6-dihydro-2H-pyrimidine-1-carbonyl]-4-phenyl-[1,4']bipiperidinyl-4-carboxylic acid methyl ester | CHEMBL145553
TypeSmall organic molecule
Emp. Form.C33H37F3N4O7
Mol. Mass.658.6647
SMILESCOCC1=C(C(N(C(=O)N2CCC(CC2)N2CCC(CC2)(C(=O)OC)c2ccccc2)C(=O)N1)c1cc(F)c(F)c(F)c1)C(=O)OC