Reaction Details
TargetAlpha-1D adrenergic receptor
LigandBDBM50082840
Substrate/Competitorn/a
Meas. Tech.ChEMBL_32453 (CHEMBL643401)
Ki 21±n/a nM
Citation Lagu, BTian, DNagarathnam, DMarzabadi, MRWong, WCMiao, SWZhang, FSun, WChiu, GFang, JForray, CChang, RSRansom, RWChen, TBO'Malley, SZhang, KVyas, KPGluchowski, C Design and synthesis of novel alpha(1)(a) adrenoceptor-selective antagonists. 3. Approaches to eliminate opioid agonist metabolites by using substituted phenylpiperazine side chains. J Med Chem42:4794-803 (1999) Alpha-1D adrenergic receptor
Name:Alpha-1D adrenergic receptor
Type:Enzyme Catalytic Domain
Mol. Mass.:60485.82
Organism:Homo sapiens (Human)
Description:adrenergic Alpha1D ADRA1D HUMAN::P25100
Residue:572
BDBM50082840
NameBDBM50082840
Synonyms:4-(3,4-Difluoro-phenyl)-6-methyl-2-oxo-3-[3-(4-phenyl-piperazin-1-yl)-propylcarbamoyl]-1,2,3,4-tetrahydro-pyrimidine-5-carboxylic acid methyl ester | CHEMBL342731
TypeSmall organic molecule
Emp. Form.C27H31F2N5O4
Mol. Mass.527.5629
SMILESCOC(=O)C1=C(C)NC(=O)N(C1c1ccc(F)c(F)c1)C(=O)NCCCN1CCN(CC1)c1ccccc1