Reaction Details
TargetAlpha-1B adrenergic receptor
LigandBDBM50082857
Substrate/Competitorn/a
Meas. Tech.ChEMBL_34459 (CHEMBL651991)
Ki 8.8±n/a nM
Citation Lagu, BTian, DNagarathnam, DMarzabadi, MRWong, WCMiao, SWZhang, FSun, WChiu, GFang, JForray, CChang, RSRansom, RWChen, TBO'Malley, SZhang, KVyas, KPGluchowski, C Design and synthesis of novel alpha(1)(a) adrenoceptor-selective antagonists. 3. Approaches to eliminate opioid agonist metabolites by using substituted phenylpiperazine side chains. J Med Chem42:4794-803 (1999) Alpha-1B adrenergic receptor
Name:Alpha-1B adrenergic receptor
Type:Enzyme
Mol. Mass.:56862.13
Organism:Homo sapiens (Human)
Description:P35368
Residue:520
BDBM50082857
NameBDBM50082857
Synonyms:4-(3,4-Difluoro-phenyl)-3-{3-[4-(2-ethoxy-phenyl)-piperazin-1-yl]-propylcarbamoyl}-6-methyl-2-oxo-1,2,3,4-tetrahydro-pyrimidine-5-carboxylic acid methyl ester | CHEMBL142251
TypeSmall organic molecule
Emp. Form.C29H35F2N5O5
Mol. Mass.571.6155
SMILESCCOc1ccccc1N1CCN(CCCNC(=O)N2C(C(C(=O)OC)=C(C)NC2=O)c2ccc(F)c(F)c2)CC1