Reaction Details
TargetAlpha-1B adrenergic receptor
LigandBDBM50082859
Substrate/Competitorn/a
Meas. Tech.ChEMBL_34459 (CHEMBL651991)
Ki 17±n/a nM
Citation Lagu, BTian, DNagarathnam, DMarzabadi, MRWong, WCMiao, SWZhang, FSun, WChiu, GFang, JForray, CChang, RSRansom, RWChen, TBO'Malley, SZhang, KVyas, KPGluchowski, C Design and synthesis of novel alpha(1)(a) adrenoceptor-selective antagonists. 3. Approaches to eliminate opioid agonist metabolites by using substituted phenylpiperazine side chains. J Med Chem42:4794-803 (1999) Alpha-1B adrenergic receptor
Name:Alpha-1B adrenergic receptor
Type:Enzyme
Mol. Mass.:56862.13
Organism:Homo sapiens (Human)
Description:P35368
Residue:520
BDBM50082859
NameBDBM50082859
Synonyms:4-(3,4-Difluoro-phenyl)-6-methyl-2-oxo-3-[3-(4-o-tolyl-piperazin-1-yl)-propylcarbamoyl]-1,2,3,4-tetrahydro-pyrimidine-5-carboxylic acid methyl ester | CHEMBL344525
TypeSmall organic molecule
Emp. Form.C28H33F2N5O4
Mol. Mass.541.5895
SMILESCOC(=O)C1=C(C)NC(=O)N(C1c1ccc(F)c(F)c1)C(=O)NCCCN1CCN(CC1)c1ccccc1C