Reaction Details
TargetAlpha-1D adrenergic receptor
LigandBDBM50082852
Substrate/Competitorn/a
Meas. Tech.ChEMBL_32453 (CHEMBL643401)
Ki 31±n/a nM
Citation Lagu, BTian, DNagarathnam, DMarzabadi, MRWong, WCMiao, SWZhang, FSun, WChiu, GFang, JForray, CChang, RSRansom, RWChen, TBO'Malley, SZhang, KVyas, KPGluchowski, C Design and synthesis of novel alpha(1)(a) adrenoceptor-selective antagonists. 3. Approaches to eliminate opioid agonist metabolites by using substituted phenylpiperazine side chains. J Med Chem42:4794-803 (1999) Alpha-1D adrenergic receptor
Name:Alpha-1D adrenergic receptor
Type:Enzyme Catalytic Domain
Mol. Mass.:60485.82
Organism:Homo sapiens (Human)
Description:adrenergic Alpha1D ADRA1D HUMAN::P25100
Residue:572
BDBM50082852
NameBDBM50082852
Synonyms:4-(3,4-Difluoro-phenyl)-3-{3-[4-(2-methoxy-phenyl)-piperazin-1-yl]-propylcarbamoyl}-6-methyl-2-oxo-1,2,3,4-tetrahydro-pyrimidine-5-carboxylic acid methyl ester | CHEMBL146654
TypeSmall organic molecule
Emp. Form.C28H33F2N5O5
Mol. Mass.557.5889
SMILESCOC(=O)C1=C(C)NC(=O)N(C1c1ccc(F)c(F)c1)C(=O)NCCCN1CCN(CC1)c1ccccc1OC