Reaction Details
TargetAlpha-1A adrenergic receptor
LigandBDBM50082853
Substrate/Competitorn/a
Meas. Tech.ChEMBL_33741 (CHEMBL647056)
Ki 4.9±n/a nM
Citation Lagu, BTian, DNagarathnam, DMarzabadi, MRWong, WCMiao, SWZhang, FSun, WChiu, GFang, JForray, CChang, RSRansom, RWChen, TBO'Malley, SZhang, KVyas, KPGluchowski, C Design and synthesis of novel alpha(1)(a) adrenoceptor-selective antagonists. 3. Approaches to eliminate opioid agonist metabolites by using substituted phenylpiperazine side chains. J Med Chem42:4794-803 (1999) Alpha-1A adrenergic receptor
Name:Alpha-1A adrenergic receptor
Type:Cell-surface receptors
Mol. Mass.:51511.67
Organism:Homo sapiens (Human)
Description:P35348
Residue:466
BDBM50082853
NameBDBM50082853
Synonyms:4-(3,4-Difluoro-phenyl)-6-methyl-2-oxo-3-{3-[4-(3-trifluoromethyl-phenyl)-piperazin-1-yl]-propylcarbamoyl}-1,2,3,4-tetrahydro-pyrimidine-5-carboxylic acid methyl ester | CHEMBL145525
TypeSmall organic molecule
Emp. Form.C28H30F5N5O4
Mol. Mass.595.5609
SMILESCOC(=O)C1=C(C)NC(=O)N(C1c1ccc(F)c(F)c1)C(=O)NCCCN1CCN(CC1)c1cccc(c1)C(F)(F)F