Reaction Details
TargetProtein farnesyltransferase subunit beta/geranylgeranyltransferase type-1 subunit alpha
LigandBDBM50082904
Substrate/Competitorn/a
Meas. Tech.ChEMBL_70735 (CHEMBL680528)
IC50 0.2±n/a nM
Citation Henry, KJWasicak, JTasker, ASCohen, JEwing, PMitten, MLarsen, JJKalvin, DMSwenson, RNg, SCSaeed, BCherian, SSham, HRosenberg, SH Discovery of a series of cyclohexylethylamine-containing protein farnesyltransferase inhibitors exhibiting potent cellular activity. J Med Chem42:4844-52 (1999) Protein farnesyltransferase subunit beta/geranylgeranyltransferase type-1 subunit alpha
Name:Protein farnesyltransferase subunit beta/geranylgeranyltransferase type-1 subunit alpha
Type:n/a
Mol. Mass.:n/a
Description:ASSAY_ID of EBI is 69815
Components:This complex has 2 components.
Component 1
Name:Protein farnesyltransferase subunit beta
Synonyms:CAAX farnesyltransferase subunit beta FTase-beta Protein farnesyltransferase Ras proteins prenyltransferase subunit beta
Type:PROTEIN
Mol. Mass.:48666.41
Organism:Rattus norvegicus
Description:EBI_10573
Residue:437
Component 2
Name:Protein farnesyltransferase/geranylgeranyltransferase type-1 subunit alpha
Synonyms:CAAX farnesyltransferase alpha subunit FTase-alpha GGTase-I-alpha Protein farnesyltransferase/geranylgeranyltransferase type I alpha subunit Type I protein geranyl-geranyltransferase alpha subunit | geranylgeranyltransferase type-I
Type:Enzyme
Mol. Mass.:44030.14
Organism:Rattus norvegicus (rat)
Description:Recombinant rat enzyme.
Residue:377
BDBM50082904
NameBDBM50082904
Synonyms:(S)-2-({5-[((S)-1-Cyclohexylmethyl-2-phenylsulfanyl-ethylamino)-methyl]-2'-methyl-biphenyl-2-carbonyl}-amino)-4-methylsulfanyl-butyric acid | CHEMBL144175
TypeSmall organic molecule
Emp. Form.C35H44N2O3S2
Mol. Mass.604.865
SMILESCSCC[C@H](NC(=O)c1ccc(CN[C@H](CSc2ccccc2)CC2CCCCC2)cc1-c1ccccc1C)C(O)=O