Reaction Details
TargetInterstitial collagenase
LigandBDBM50082945
Substrate/Competitorn/a
Meas. Tech.ChEMBL_105968 (CHEMBL715380)
IC50 1.1±n/a nM
Citation Barlaam, BBird, TGLambert-Van Der Brempt, CCampbell, DFoster, SJMaciewicz, R New alpha-substituted succinate-based hydroxamic acids as TNFalpha convertase inhibitors. J Med Chem42:4890-908 (1999) Interstitial collagenase
Name:Interstitial collagenase
Type:Enzyme
Mol. Mass.:54010.26
Organism:Homo sapiens (Human)
Description: P03956
Residue:469
BDBM50082945
NameBDBM50082945
Synonyms:(2R,3S)-N*1*-((S)-2,2-Dimethyl-1-methylcarbamoyl-propyl)-N*4*-hydroxy-2-isobutyl-3-(quinoline-8-sulfonylamino)-succinamide | CHEMBL144843
TypeSmall organic molecule
Emp. Form.C24H35N5O6S
Mol. Mass.521.63
SMILESCNC(=O)[C@@H](NC(=O)[C@H](CC(C)C)[C@H](NS(=O)(=O)c1cccc2cccnc12)C(=O)NO)C(C)(C)C