Reaction Details
TargetInterstitial collagenase
LigandBDBM50063920
Substrate/Competitorn/a
Meas. Tech.ChEMBL_105968 (CHEMBL715380)
IC50 10±n/a nM
Citation Barlaam, BBird, TGLambert-Van Der Brempt, CCampbell, DFoster, SJMaciewicz, R New alpha-substituted succinate-based hydroxamic acids as TNFalpha convertase inhibitors. J Med Chem42:4890-908 (1999) Interstitial collagenase
Name:Interstitial collagenase
Type:Enzyme
Mol. Mass.:54010.26
Organism:Homo sapiens (Human)
Description: P03956
Residue:469
BDBM50063920
NameBDBM50063920
Synonyms:(R)-N*1*-((S)-2,2-Dimethyl-1-methylcarbamoyl-propyl)-N*4*-hydroxy-2-isobutyl-succinamide CHEMBL16520 | Ro-31-9790
TypeSmall organic molecule
Emp. Form.C15H29N3O4
Mol. Mass.315.4085
SMILESCNC(=O)[C@@H](NC(=O)[C@H](CC(C)C)CC(=O)NO)C(C)(C)C