Reaction Details
TargetRetinoic acid receptor RXR-gamma
LigandBDBM50083047
Substrate/Competitorn/a
Meas. Tech.ChEMBL_197239 (CHEMBL803361)
Kd>10000±n/a nM
Citation Simoni, DInvidiata, FPRondanin, RGrimaudo, SCannizzo, GBarbusca, EPorretto, FD'Alessandro, NTolomeo, M Structure-activity relationship studies of novel heteroretinoids: induction of apoptosis in the HL-60 cell line by a novel isoxazole-containing heteroretinoid. J Med Chem42:4961-9 (2000) Retinoic acid receptor RXR-gamma
Name:Retinoic acid receptor RXR-gamma
Type:PROTEIN
Mol. Mass.:50878.26
Organism:Homo sapiens (Human)
Description:ChEMBL_197216
Residue:463
BDBM50083047
NameBDBM50083047
Synonyms:5-[(Z)-2-(5,5,8,8-Tetramethyl-5,6,7,8-tetrahydro-naphthalen-2-yl)-propenyl]-isoxazole-3-carboxylic acid | CHEMBL92096
TypeSmall organic molecule
Emp. Form.C21H25NO3
Mol. Mass.339.4281
SMILESC\C(=C\c1cc(no1)C(O)=O)c1ccc2c(c1)C(C)(C)CCC2(C)C