Reaction Details
TargetRetinoic acid receptor alpha
LigandBDBM31883
Substrate/Competitorn/a
Meas. Tech.ChEMBL_195304 (CHEMBL799860)
EC50 5±n/a nM
Citation Simoni, DInvidiata, FPRondanin, RGrimaudo, SCannizzo, GBarbusca, EPorretto, FD'Alessandro, NTolomeo, M Structure-activity relationship studies of novel heteroretinoids: induction of apoptosis in the HL-60 cell line by a novel isoxazole-containing heteroretinoid. J Med Chem42:4961-9 (2000) Retinoic acid receptor alpha
Name:Retinoic acid receptor alpha
Type:PROTEIN
Mol. Mass.:50778.87
Organism:Homo sapiens (Human)
Description:ChEMBL_1466191
Residue:462
BDBM31883
NameBDBM31883
Synonyms:9-cis-retinoic acid (9cRA) AT-RA CHEMBL38 SMR000058245 Vitamin A acid [3H]Retinoic acid [3H]tretinoin cid_444795
Typeradiolabeled ligand
Emp. Form.C20H28O2
Mol. Mass.300.4351
SMILESC\C(\C=C\C1=C(C)CCCC1(C)C)=C/C=C/C(/C)=C/C(O)=O