Reaction Details
Target5-hydroxytryptamine receptor 1D
LigandBDBM50083108
Substrate/Competitorn/a
Meas. Tech.ChEMBL_1700 (CHEMBL616907)
IC50 0.6±n/a nM
Citation Russell, MGMatassa, VGPengilley, RRvan Niel, MBSohal, BWatt, APHitzel, LBeer, MSStanton, JABroughton, HBCastro, JL 3-[3-(Piperidin-1-yl)propyl]indoles as highly selective h5-HT(1D) receptor agonists. J Med Chem42:4981-5001 (2000) 5-hydroxytryptamine receptor 1D
Name:5-hydroxytryptamine receptor 1D
Type:G Protein-Coupled Receptor (GPCR)
Mol. Mass.:41920.63
Organism:Homo sapiens (Human)
Description:Receptor binding assays were performed using human clone stably expressed in CHO cells.
Residue:377
BDBM50083108
NameBDBM50083108
Synonyms:CHEMBL146483 | N-{4-[(S)-1-({1-[3-(5-[1,2,4]Triazol-4-yl-1H-indol-3-yl)-propyl]-piperidin-4-ylmethyl}-amino)-ethyl]-phenyl}-acetamide
TypeSmall organic molecule
Emp. Form.C29H37N7O
Mol. Mass.499.6504
SMILESC[C@H](NCC1CCN(CCCc2c[nH]c3ccc(cc23)-n2cnnc2)CC1)c1ccc(NC(C)=O)cc1