Reaction Details
Target5-hydroxytryptamine receptor 1D
LigandBDBM50083114
Substrate/Competitorn/a
Meas. Tech.ChEMBL_1676 (CHEMBL616666)
EC50 6.8±n/a nM
Citation Russell, MGMatassa, VGPengilley, RRvan Niel, MBSohal, BWatt, APHitzel, LBeer, MSStanton, JABroughton, HBCastro, JL 3-[3-(Piperidin-1-yl)propyl]indoles as highly selective h5-HT(1D) receptor agonists. J Med Chem42:4981-5001 (2000) 5-hydroxytryptamine receptor 1D
Name:5-hydroxytryptamine receptor 1D
Type:G Protein-Coupled Receptor (GPCR)
Mol. Mass.:41920.63
Organism:Homo sapiens (Human)
Description:Receptor binding assays were performed using human clone stably expressed in CHO cells.
Residue:377
BDBM50083114
NameBDBM50083114
Synonyms:((R)-1-Methyl-2-phenyl-ethyl)-{1-[3-(5-[1,2,4]triazol-4-yl-1H-indol-3-yl)-propyl]-piperidin-4-yl}-amine | CHEMBL146502
TypeSmall organic molecule
Emp. Form.C27H34N6
Mol. Mass.442.5991
SMILESC[C@H](Cc1ccccc1)NC1CCN(CCCc2c[nH]c3ccc(cc23)-n2cnnc2)CC1